Reaction Details
TargetAcetylcholinesterase
LigandBDBM167911
Substrate/Competitorn/a
Meas. Tech.Modified Ellman Assay
IC50 3.4e+2± 3e+1 nM
Citation Sang, ZPQiang, XMLi, YWu, BZhang, HZhao, MGDeng, Y Design, synthesis, and biological evaluation of scutellarein carbamate derivatives as potential multifunctional agents for the treatment of Alzheimer's disease. Chem Biol Drug Des86:1168-77 (2015) 
 
Acetylcholinesterase
Name:Acetylcholinesterase
Type:Enzyme
Mol. Mass.:68193.62
Organism:Rattus norvegicus (rat)
Description:P37136
Residue:614
BDBM167911
NameBDBM167911
Synonyms:N,N-diethylcarbamic acid-4-(5,6,7-trimethoxy-4-oxo-4H-1-benzopyran-2-yl)phenyl ester (7i)
TypeSmall organic molecule
Emp. Form.C23H25NO7
Mol. Mass.427.4471
SMILESCCN(CC)C(=O)Oc1ccc(cc1)-c1cc(=O)c2c(OC)c(OC)c(OC)cc2o1