Reaction Details
TargetAcetylcholinesterase
LigandBDBM167913
Substrate/Competitorn/a
Meas. Tech.Modified Ellman Assay
IC50 1.5e+3± 7e+1 nM
Citation Sang, ZPQiang, XMLi, YWu, BZhang, HZhao, MGDeng, Y Design, synthesis, and biological evaluation of scutellarein carbamate derivatives as potential multifunctional agents for the treatment of Alzheimer's disease. Chem Biol Drug Des86:1168-77 (2015) 
 
Acetylcholinesterase
Name:Acetylcholinesterase
Type:Enzyme
Mol. Mass.:68193.62
Organism:Rattus norvegicus (rat)
Description:P37136
Residue:614
BDBM167913
NameBDBM167913
Synonyms:N,N-diethylcarbamic acid-4-[5,6,7-tris(acetyloxy)-4-oxo-4H-1-benzopyran-2-yl]phenyl ester (7k)
TypeSmall organic molecule
Emp. Form.C26H25NO10
Mol. Mass.511.4774
SMILESCCN(CC)C(=O)Oc1ccc(cc1)-c1cc(=O)c2c(OC(C)=O)c(OC(C)=O)c(OC(C)=O)cc2o1