Reaction Details
TargetCarboxylic ester hydrolase
LigandBDBM167906
Substrate/Competitorn/a
Meas. Tech.Modified Ellman Assay
IC50 3.05e+4± 1e+2 nM
Citation Sang, ZPQiang, XMLi, YWu, BZhang, HZhao, MGDeng, Y Design, synthesis, and biological evaluation of scutellarein carbamate derivatives as potential multifunctional agents for the treatment of Alzheimer's disease. Chem Biol Drug Des86:1168-77 (2015) 
 
Carboxylic ester hydrolase
Name:Carboxylic ester hydrolase
Type:Enzyme
Mol. Mass.:67776.22
Organism:Rattus norvegicus (rat)
Description:n/a
Residue:597
BDBM167906
NameBDBM167906
Synonyms:N-ethyl-N-methylcarbamic acid-4-(5,6,7-trihydroxy-4-oxo-4H-1-benzopyran-2-yl)phenyl ester (7d)
TypeSmall organic molecule
Emp. Form.C19H17NO7
Mol. Mass.371.3408
SMILESCCN(C)C(=O)Oc1ccc(cc1)-c1cc(=O)c2c(O)c(O)c(O)cc2o1