Reaction Details
TargetCarboxylic ester hydrolase
LigandBDBM167909
Substrate/Competitorn/a
Meas. Tech.Modified Ellman Assay
IC50>1.00e+5±n/a nM
Citation Sang, ZPQiang, XMLi, YWu, BZhang, HZhao, MGDeng, Y Design, synthesis, and biological evaluation of scutellarein carbamate derivatives as potential multifunctional agents for the treatment of Alzheimer's disease. Chem Biol Drug Des86:1168-77 (2015) 
 
Carboxylic ester hydrolase
Name:Carboxylic ester hydrolase
Type:Enzyme
Mol. Mass.:67776.22
Organism:Rattus norvegicus (rat)
Description:n/a
Residue:597
BDBM167909
NameBDBM167909
Synonyms:1-Piperidinecarboxylic acid-4-(5,6,7-trihydroxy-4-oxo-4H-1-benzopyran-2-yl)phenyl ester (7g)
TypeSmall organic molecule
Emp. Form.C21H19NO7
Mol. Mass.397.3781
SMILESOc1cc2oc(cc(=O)c2c(O)c1O)-c1ccc(OC(=O)N2CCCCC2)cc1