Reaction Details
TargetCarboxylic ester hydrolase
LigandBDBM167910
Substrate/Competitorn/a
Meas. Tech.Modified Ellman Assay
IC50 3.50e+4± 5.5e+2 nM
Citation Sang, ZPQiang, XMLi, YWu, BZhang, HZhao, MGDeng, Y Design, synthesis, and biological evaluation of scutellarein carbamate derivatives as potential multifunctional agents for the treatment of Alzheimer's disease. Chem Biol Drug Des86:1168-77 (2015) 
 
Carboxylic ester hydrolase
Name:Carboxylic ester hydrolase
Type:Enzyme
Mol. Mass.:67776.22
Organism:Rattus norvegicus (rat)
Description:n/a
Residue:597
BDBM167910
NameBDBM167910
Synonyms:4-(Phenylmethyl)-1-piperidinecarboxylic acid-4-(5,6,7-trihydroxy-4-oxo-4H-1-benzopyran-2-yl)phenyl ester (7h)
TypeSmall organic molecule
Emp. Form.C28H25NO7
Mol. Mass.487.5006
SMILESOc1cc2oc(cc(=O)c2c(O)c1O)-c1ccc(OC(=O)N2CCC(Cc3ccccc3)CC2)cc1