Reaction Details
TargetCarboxylic ester hydrolase
LigandBDBM167912
Substrate/Competitorn/a
Meas. Tech.Modified Ellman Assay
IC50 2.26e+4± 2.2e+2 nM
Citation Sang, ZPQiang, XMLi, YWu, BZhang, HZhao, MGDeng, Y Design, synthesis, and biological evaluation of scutellarein carbamate derivatives as potential multifunctional agents for the treatment of Alzheimer's disease. Chem Biol Drug Des86:1168-77 (2015) 
 
Carboxylic ester hydrolase
Name:Carboxylic ester hydrolase
Type:Enzyme
Mol. Mass.:67776.22
Organism:Rattus norvegicus (rat)
Description:n/a
Residue:597
BDBM167912
NameBDBM167912
Synonyms:N,N-diethylcarbamic acid-4-(5-hydroxy-6,7-dimethoxy-4-oxo-4H-1-benzopyran-2-yl)phenyl ester (7j)
TypeSmall organic molecule
Emp. Form.C22H23NO7
Mol. Mass.413.4205
SMILESCCN(CC)C(=O)Oc1ccc(cc1)-c1cc(=O)c2c(O)c(OC)c(OC)cc2o1