Reaction Details
TargetCarboxylic ester hydrolase
LigandBDBM167914
Substrate/Competitorn/a
Meas. Tech.Modified Ellman Assay
IC50 6.21e+4± 5.0e+2 nM
Citation Sang, ZPQiang, XMLi, YWu, BZhang, HZhao, MGDeng, Y Design, synthesis, and biological evaluation of scutellarein carbamate derivatives as potential multifunctional agents for the treatment of Alzheimer's disease. Chem Biol Drug Des86:1168-77 (2015) 
 
Carboxylic ester hydrolase
Name:Carboxylic ester hydrolase
Type:Enzyme
Mol. Mass.:67776.22
Organism:Rattus norvegicus (rat)
Description:n/a
Residue:597
BDBM167914
NameBDBM167914
Synonyms:N,N-diethylcarbamic acid-4-[6,7-bis(acetyloxy)-5-hydroxy-4-oxo-4H-1-benzopyran-2-yl]phenyl ester (7l)
TypeSmall organic molecule
Emp. Form.C24H23NO9
Mol. Mass.469.4407
SMILESCCN(CC)C(=O)Oc1ccc(cc1)-c1cc(=O)c2c(O)c(OC(C)=O)c(OC(C)=O)cc2o1