Reaction Details
TargetVascular endothelial growth factor receptor 2
LigandBDBM167961
Substrate/Competitorn/a
Meas. Tech.VEGFR2 Kinase Assay
pH7.2±n/a
Temperature298.15±n/a K
IC50 62.97±0.0 nM
Commentsextracted
Citation Yin, YSha, SWang, YTWu, XWang, SFQiao, FLv, PCZhu, HL Discovery of new 4-alkoxyquinazoline-based derivatives as potent VEGFR2 inhibitors. Chem Biol Drug Des86:1323-9 (2015) 
 
Vascular endothelial growth factor receptor 2
Name:Vascular endothelial growth factor receptor 2
Type:Receptor Tyrosine Kinase
Mol. Mass.:151510.97
Organism:Homo sapiens (Human)
Description:P35968
Residue:1356
BDBM167961
NameBDBM167961
Synonyms:1-(Dimethylamino)-3-(quinazolin-4-yloxy)propan-2-ol (3q)
TypeSmall organic molecule
Emp. Form.C13H17N3O2
Mol. Mass.247.293
SMILESCN(C)CC(O)COc1ncnc2ccccc12