Reaction Details
TargetEpidermal growth factor receptor
LigandBDBM167960
Substrate/Competitorn/a
Meas. Tech.VEGFR2 Kinase Assay
pH7.2±n/a
Temperature298.15±n/a K
IC50 461.54±0.0 nM
Commentsextracted
Citation Yin, YSha, SWang, YTWu, XWang, SFQiao, FLv, PCZhu, HL Discovery of new 4-alkoxyquinazoline-based derivatives as potent VEGFR2 inhibitors. Chem Biol Drug Des86:1323-9 (2015) 
 
Epidermal growth factor receptor
Name:Epidermal growth factor receptor
Type:Receptor Kinase Domain
Mol. Mass.:134279.59
Organism:Homo sapiens (Human)
Description:P00533
Residue:1210
BDBM167960
NameBDBM167960
Synonyms:1-(4-Ethylpiperazin-1-yl)-3-(quinazolin-4-yloxy)propan-2-ol (3p)
TypeSmall organic molecule
Emp. Form.C17H24N4O2
Mol. Mass.316.3981
SMILESCCN1CCN(CC(O)COc2ncnc3ccccc23)CC1