Reaction Details
TargetEpidermal growth factor receptor
LigandBDBM167964
Substrate/Competitorn/a
Meas. Tech.VEGFR2 Kinase Assay
pH7.2±n/a
Temperature298.15±n/a K
IC50 483.26±0.0 nM
Commentsextracted
Citation Yin, YSha, SWang, YTWu, XWang, SFQiao, FLv, PCZhu, HL Discovery of new 4-alkoxyquinazoline-based derivatives as potent VEGFR2 inhibitors. Chem Biol Drug Des86:1323-9 (2015) 
 
Epidermal growth factor receptor
Name:Epidermal growth factor receptor
Type:Receptor Kinase Domain
Mol. Mass.:134279.59
Organism:Homo sapiens (Human)
Description:P00533
Residue:1210
BDBM167964
NameBDBM167964
Synonyms:1-(1H-Imidazol-1-yl)-3-(quinazolin-4-yloxy)propan-2-ol (3t)
TypeSmall organic molecule
Emp. Form.C14H14N4O2
Mol. Mass.270.2866
SMILESOC(COc1ncnc2ccccc12)Cn1ccnc1