Reaction Details
TargetFibroblast growth factor 2
LigandBDBM167947
Substrate/Competitorn/a
Meas. Tech.VEGFR2 Kinase Assay
pH7.2±n/a
Temperature298.15±n/a K
IC50 401.86±0.0 nM
Commentsextracted
Citation Yin, YSha, SWang, YTWu, XWang, SFQiao, FLv, PCZhu, HL Discovery of new 4-alkoxyquinazoline-based derivatives as potent VEGFR2 inhibitors. Chem Biol Drug Des86:1323-9 (2015) 
 
Fibroblast growth factor 2
Name:Fibroblast growth factor 2
Type:Protein
Mol. Mass.:30803.89
Organism:Homo sapiens (Human)
Description:P09038
Residue:288
BDBM167947
NameBDBM167947
Synonyms:1-(4-(3-Chlorophenyl)piperazin-1-yl)-3-(quinazolin-4-yloxy)propan-2-ol (3c)
TypeSmall organic molecule
Emp. Form.C21H23ClN4O2
Mol. Mass.398.886
SMILESOC(COc1ncnc2ccccc12)CN1CCN(CC1)c1cccc(Cl)c1