Reaction Details
TargetFibroblast growth factor 2
LigandBDBM167950
Substrate/Competitorn/a
Meas. Tech.VEGFR2 Kinase Assay
pH7.2±n/a
Temperature298.15±n/a K
IC50 247.72±0.0 nM
Commentsextracted
Citation Yin, YSha, SWang, YTWu, XWang, SFQiao, FLv, PCZhu, HL Discovery of new 4-alkoxyquinazoline-based derivatives as potent VEGFR2 inhibitors. Chem Biol Drug Des86:1323-9 (2015) 
 
Fibroblast growth factor 2
Name:Fibroblast growth factor 2
Type:Protein
Mol. Mass.:30803.89
Organism:Homo sapiens (Human)
Description:P09038
Residue:288
BDBM167950
NameBDBM167950
Synonyms:1-(4-(4-Nitrophenyl)piperazin-1-yl)-3-(quinazolin-4-yloxy)propan-2-ol (3f)
TypeSmall organic molecule
Emp. Form.C21H23N5O4
Mol. Mass.409.4384
SMILESOC(COc1ncnc2ccccc12)CN1CCN(CC1)c1ccc(cc1)[N+]([O-])=O