Reaction Details
TargetPlatelet-derived growth factor receptor beta
LigandBDBM167963
Substrate/Competitorn/a
Meas. Tech.VEGFR2 Kinase Assay
pH7.2±n/a
Temperature298.15±n/a K
IC50 283.16±0.0 nM
Commentsextracted
Citation Yin, YSha, SWang, YTWu, XWang, SFQiao, FLv, PCZhu, HL Discovery of new 4-alkoxyquinazoline-based derivatives as potent VEGFR2 inhibitors. Chem Biol Drug Des86:1323-9 (2015) 
 
Platelet-derived growth factor receptor beta
Name:Platelet-derived growth factor receptor beta
Type:Enzyme
Mol. Mass.:123922.25
Organism:Homo sapiens (Human)
Description:P09619
Residue:1106
BDBM167963
NameBDBM167963
Synonyms:1-(Piperidin-1-yl)-3-(quinazolin-4-yloxy)propan-2-ol (3s)
TypeSmall organic molecule
Emp. Form.C16H21N3O2
Mol. Mass.287.3568
SMILESOC(COc1ncnc2ccccc12)CN1CCCCC1