Reaction Details
TargetOxysterols receptor LXR-alpha
LigandBDBM168117
Substrate/Competitorn/a
Meas. Tech.Radioligand Binding Assay
Temperature298.15±n/a K
Ki 83±n/a nM
Commentsextracted
Citation Leftheris, KZhuang, L Liver X receptor modulators US Patent US9073931 Publication Date 7/7/2015
 
Oxysterols receptor LXR-alpha
Name:Oxysterols receptor LXR-alpha
Type:Enzyme Catalytic Domain
Mol. Mass.:50403.85
Organism:Homo sapiens (Human)
Description:Q13133
Residue:447
BDBM168117
NameBDBM168117
Synonyms:US9073931, E25a
TypeSmall organic molecule
Emp. Form.C20H22F3N5O3S
Mol. Mass.469.481
SMILESCC(C)[C@H]1N(CCn2c1nc1ccc(cc21)S(C)(=O)=O)c1ncc(CO)c(n1)C(F)(F)F