Reaction Details
TargetOxysterols receptor LXR-beta
LigandBDBM168079
Substrate/Competitorn/a
Meas. Tech.Radioligand Binding Assay
Temperature298.15±n/a K
Ki 2±n/a nM
Commentsextracted
Citation Leftheris, KZhuang, L Liver X receptor modulators US Patent US9073931 Publication Date 7/7/2015
 
Oxysterols receptor LXR-beta
Name:Oxysterols receptor LXR-beta
Type:Enzyme Catalytic Domain
Mol. Mass.:50978.79
Organism:Homo sapiens (Human)
Description:P55055
Residue:460
BDBM168079
NameBDBM168079
Synonyms:US9073931, E27a | US9073931, E7a
TypeSmall organic molecule
Emp. Form.C23H28F3N5O4S
Mol. Mass.527.56
SMILESCC(C)[C@H]1N(CCn2c1nc1cc(CO)c(cc21)S(C)(=O)=O)c1ncc(c(n1)C(F)(F)F)C(C)(C)O