Reaction Details
TargetDual specificity calcium/calmodulin-dependent 3',5'-cyclic nucleotide phosphodiesterase 1A
LigandBDBM168129
Substrate/Competitorn/a
Meas. Tech.Enzyme Assay
pH7.5±n/a
Temperature303.15±n/a K
Ki 0.4±n/a nM
Commentsextracted
Citation Li, PZheng, HZhao, JWennogle, LP Organic compounds US Patent US9073936 Publication Date 7/7/2015
 
Dual specificity calcium/calmodulin-dependent 3',5'-cyclic nucleotide phosphodiesterase 1A
Name:Dual specificity calcium/calmodulin-dependent 3',5'-cyclic nucleotide phosphodiesterase 1A
Type:Protein
Mol. Mass.:61245.69
Organism:Homo sapiens (Human)
Description:P54750
Residue:535
BDBM168129
NameBDBM168129
Synonyms:US9073936, 4 | US9598426, 4
TypeSmall organic molecule
Emp. Form.C26H27FN6O2
Mol. Mass.474.53
SMILESCN1C2=NC(C)(C)CN2c2nn(Cc3ccc(cc3)C(C)=O)c(Nc3ccc(F)c(C)c3)c2C1=O