Reaction Details
TargetRho-associated protein kinase 2
LigandBDBM169502
Substrate/Competitorn/a
Meas. Tech.IMAP Assay
pH7.2±n/a
IC50 0.4±n/a nM
Commentsextracted
Citation Ginn, JDMarshall, DRSibley, RSorcek, RJYoung, ERZhang, Y Rho kinase inhibitors US Patent US9079880 Publication Date 7/14/2015
 
Rho-associated protein kinase 2
Name:Rho-associated protein kinase 2
Type:Protein
Mol. Mass.:160885.43
Organism:Homo sapiens (Human)
Description:O75116
Residue:1388
BDBM169502
NameBDBM169502
Synonyms:US9079880, 35
TypeSmall organic molecule
Emp. Form.C28H34N4O3S
Mol. Mass.506.66
SMILESCCCN[C@H]1CCc2nc(NC(=O)c3cccc(c3)[C@@H](C)NC(=O)c3ccc(OC)c(C)c3)sc2C1