Reaction Details
TargetEpidermal growth factor receptor
LigandBDBM170461
Substrate/Competitorn/a
Meas. Tech.Inhibition Assay
IC50 1.3±n/a nM
Citation Matsuya, TKondoh, YShimada, IKikuchi, SIida, MOnda, KFukudome, HTakemoto, YShindou, NSakagami, HHamaguchi, H Pyrazinecarboxamide compound US Patent US9085540 Publication Date 7/21/2015
 
Epidermal growth factor receptor
Name:Epidermal growth factor receptor
Type:Receptor Kinase Domain
Mol. Mass.:134279.59
Organism:Homo sapiens (Human)
Description:P00533
Residue:1210
BDBM170461
NameBDBM170461
Synonyms:US9085540, 1
TypeSmall organic molecule
Emp. Form.C27H31N7O3
Mol. Mass.501.5801
SMILESCCc1nc(C(N)=O)c(Nc2ccc(cc2)N2CCN(C)CC2)nc1Oc1cccc(NC(=O)C=C)c1