Reaction Details
TargetEpidermal growth factor receptor
LigandBDBM170484
Substrate/Competitorn/a
Meas. Tech.Inhibition Assay
IC50 1.1±n/a nM
Citation Matsuya, TKondoh, YShimada, IKikuchi, SIida, MOnda, KFukudome, HTakemoto, YShindou, NSakagami, HHamaguchi, H Pyrazinecarboxamide compound US Patent US9085540 Publication Date 7/21/2015
 
Epidermal growth factor receptor
Name:Epidermal growth factor receptor
Type:Receptor Kinase Domain
Mol. Mass.:134279.59
Organism:Homo sapiens (Human)
Description:P00533
Residue:1210
BDBM170484
NameBDBM170484
Synonyms:US9085540, 24
TypeSmall organic molecule
Emp. Form.C32H46N8O2
Mol. Mass.574.76
SMILESCCc1nc(C(N)=O)c(Nc2ccc(N3CCC(CC3)N3CCN(C)CC3)c(C)c2)nc1C1CCN(CC1)C(=O)C=C