Reaction Details
TargetEpidermal growth factor receptor
LigandBDBM170516
Substrate/Competitorn/a
Meas. Tech.Inhibition Assay
IC50 1.3±n/a nM
Citation Matsuya, TKondoh, YShimada, IKikuchi, SIida, MOnda, KFukudome, HTakemoto, YShindou, NSakagami, HHamaguchi, H Pyrazinecarboxamide compound US Patent US9085540 Publication Date 7/21/2015
 
Epidermal growth factor receptor
Name:Epidermal growth factor receptor
Type:Receptor Kinase Domain
Mol. Mass.:134279.59
Organism:Homo sapiens (Human)
Description:P00533
Residue:1210
BDBM170516
NameBDBM170516
Synonyms:US9085540, 56
TypeSmall organic molecule
Emp. Form.C26H32N8O3
Mol. Mass.504.5841
SMILESCC(C)c1nc(C(N)=O)c(Nc2cnn(c2)C2CCN(C)CC2)nc1Oc1cccc(NC(=O)C=C)c1