Reaction Details
TargetEpidermal growth factor receptor
LigandBDBM170533
Substrate/Competitorn/a
Meas. Tech.Inhibition Assay
IC50 1.2±n/a nM
Citation Matsuya, TKondoh, YShimada, IKikuchi, SIida, MOnda, KFukudome, HTakemoto, YShindou, NSakagami, HHamaguchi, H Pyrazinecarboxamide compound US Patent US9085540 Publication Date 7/21/2015
 
Epidermal growth factor receptor
Name:Epidermal growth factor receptor
Type:Receptor Kinase Domain
Mol. Mass.:134279.59
Organism:Homo sapiens (Human)
Description:P00533
Residue:1210
BDBM170533
NameBDBM170533
Synonyms:US9085540, 73
TypeSmall organic molecule
Emp. Form.C25H35N7O3
Mol. Mass.481.5905
SMILESCCC(=O)N1CC[C@H](C1)Oc1nc(Nc2ccc(cc2)N2CCN(C)CC2)c(nc1CC)C(N)=O