Reaction Details
TargetEpidermal growth factor receptor
LigandBDBM170486
Substrate/Competitorn/a
Meas. Tech.Inhibition Assay
IC50 0.92±n/a nM
Citation Matsuya, TKondoh, YShimada, IKikuchi, SIida, MOnda, KFukudome, HTakemoto, YShindou, NSakagami, HHamaguchi, H Pyrazinecarboxamide compound US Patent US9085540 Publication Date 7/21/2015
 
Epidermal growth factor receptor
Name:Epidermal growth factor receptor
Type:Receptor Kinase Domain
Mol. Mass.:134279.59
Organism:Homo sapiens (Human)
Description:P00533
Residue:1210
BDBM170486
NameBDBM170486
Synonyms:US9085540, 26
TypeSmall organic molecule
Emp. Form.C25H27N7O3
Mol. Mass.473.527
SMILESCN1CCN(CC1)c1ccc(Nc2nc(Oc3cccc(NC(=O)C=C)c3)cnc2C(N)=O)cc1