Reaction Details
TargetComplement factor D
LigandBDBM170701
Substrate/Competitorn/a
Meas. Tech.In Vitro Assay
pH7.5±n/a
Temperature298.15±n/a K
IC50 4±n/a nM
Commentsextracted
Citation Altmann, EHommel, ULorthiois, ELMaibaum, JKOstermann, NQuancard, JRandl, SARogel, OSimic, OVulpetti, A Complement pathway modulators and uses thereof US Patent US9085555 Publication Date 7/21/2015
 
Complement factor D
Name:Complement factor D
Type:Protein
Mol. Mass.:27039.19
Organism:Homo sapiens (Human)
Description:P00746
Residue:253
BDBM170701
NameBDBM170701
Synonyms:US9085555, 129
TypeSmall organic molecule
Emp. Form.C25H24ClFN4O4
Mol. Mass.498.934
SMILESCC(=O)n1cc(NC(=O)N2[C@@H]3C[C@@H]3C[C@H]2C(=O)N[C@H](CO)c2cccc(Cl)c2F)c2ccccc12