Reaction Details
TargetComplement factor D
LigandBDBM170750
Substrate/Competitorn/a
Meas. Tech.In Vitro Assay
pH7.5±n/a
Temperature298.15±n/a K
IC50 6±n/a nM
Commentsextracted
Citation Altmann, EHommel, ULorthiois, ELMaibaum, JKOstermann, NQuancard, JRandl, SARogel, OSimic, OVulpetti, A Complement pathway modulators and uses thereof US Patent US9085555 Publication Date 7/21/2015
 
Complement factor D
Name:Complement factor D
Type:Protein
Mol. Mass.:27039.19
Organism:Homo sapiens (Human)
Description:P00746
Residue:253
BDBM170750
NameBDBM170750
Synonyms:US9085555, 178
TypeSmall organic molecule
Emp. Form.C21H19ClFN5O3S
Mol. Mass.475.924
SMILESNC(=O)n1cc(NC(=O)N2CCS[C@H]2C(=O)NCc2cccc(Cl)c2F)c2ccccc12