Reaction Details
TargetComplement factor D
LigandBDBM171304
Substrate/Competitorn/a
Meas. Tech.In Vitro Assay
pH7.5±n/a
Temperature298.15±n/a K
IC50 4±n/a nM
Commentsextracted
Citation Altmann, EHommel, ULorthiois, ELMaibaum, JKOstermann, NQuancard, JRandl, SARogel, OSimic, OVulpetti, A Complement pathway modulators and uses thereof US Patent US9085555 Publication Date 7/21/2015
 
Complement factor D
Name:Complement factor D
Type:Protein
Mol. Mass.:27039.19
Organism:Homo sapiens (Human)
Description:P00746
Residue:253
BDBM171304
NameBDBM171304
Synonyms:US9085555, 734
TypeSmall organic molecule
Emp. Form.C21H20BrN7O3
Mol. Mass.498.333
SMILESCc1cc2c(nn(CC(=O)N3[C@@H]4C[C@@H]4C[C@H]3C(=O)Nc3cccc(Br)n3)c2cn1)C(N)=O