Reaction Details
TargetComplement factor D
LigandBDBM171318
Substrate/Competitorn/a
Meas. Tech.In Vitro Assay
pH7.5±n/a
Temperature298.15±n/a K
IC50 4±n/a nM
Commentsextracted
Citation Altmann, EHommel, ULorthiois, ELMaibaum, JKOstermann, NQuancard, JRandl, SARogel, OSimic, OVulpetti, A Complement pathway modulators and uses thereof US Patent US9085555 Publication Date 7/21/2015
 
Complement factor D
Name:Complement factor D
Type:Protein
Mol. Mass.:27039.19
Organism:Homo sapiens (Human)
Description:P00746
Residue:253
BDBM171318
NameBDBM171318
Synonyms:US9085555, 748
TypeSmall organic molecule
Emp. Form.C27H24BrN7O4
Mol. Mass.590.428
SMILESCC(=O)c1nn(CC(=O)N2[C@@H]3C[C@@H]3C[C@H]2C(=O)Nc2cccc(Br)n2)c2ccc(OCc3ncccn3)cc12