Reaction Details
Targetvon Hippel-Lindau disease tumor suppressor
LigandBDBM171827
Substrate/Competitorn/a
Meas. Tech.Inhibition Assay
pH7.5±n/a
IC50 700±0 nM
Commentsextracted
Citation Flamme, IErgüden, JOehme, FThede, KKarig, GKuhl, AWild, HSchuhmacher, JKolkhof, PBärfacker, LHütter, J 4-(pyridin-3-yl)-2(pyridin-2yl)-1,2-dihydro-3H-pyrazol-3-one derivatives as specific HIF-pyrolyl-4-hydroxylase inhibitors for treating cardiovascular and haematological diseases US Patent US9085572 Publication Date 7/21/2015
 
von Hippel-Lindau disease tumor suppressor
Name:von Hippel-Lindau disease tumor suppressor
Type:Protein
Mol. Mass.:24136.87
Organism:Homo sapiens (Human)
Description:P40337
Residue:213
BDBM171827
NameBDBM171827
Synonyms:US9085572, 46
Typen/a
Emp. Form.C22H19N5O2
Mol. Mass.385.4186
SMILESO=C(Cc1ccccc1)NCc1ccnc(c1)-n1[nH]cc(-c2cccnc2)c1=O