Reaction Details
TargetTGF-beta receptor type-1
LigandBDBM172454
Substrate/Competitorn/a
Meas. Tech.Kinase Assay
IC50 35.2±3.41 nM
Citation Barrett, SDKramer, JBBoys, MLChen, H Therapeutic pyrazolyl thienopyridines US Patent US9090625 Publication Date 7/28/2015
 
TGF-beta receptor type-1
Name:TGF-beta receptor type-1
Type:enzyme
Mol. Mass.:55968.24
Organism:Homo sapiens (Human)
Description:P36897
Residue:503
BDBM172454
NameBDBM172454
Synonyms:US9090625, 6 US9938289, 6
TypeSmall organic molecule
Emp. Form.C18H16N4S
Mol. Mass.320.411
SMILESCc1nn(c(c1C)-c1cc2cnccc2s1)-c1cccc(C)n1