Reaction Details
TargetHistone deacetylase 1
LigandBDBM172895
Substrate/Competitorn/a
Meas. Tech.Flag Assay
IC50 16±n/a nM
Citation Harrington, PHeidebrecht, Jr., RWKattar, SMiller, TAOtte, KMSiliphaivanh, PStanton, MGTempest, PWilson, KJWitter, DJ 4-carboxybenzylamino derivatives as histone deacetylase inhibitors US Patent US9096559 Publication Date 8/4/2015
 
Histone deacetylase 1
Name:Histone deacetylase 1
Type:Enzyme
Mol. Mass.:55090.27
Organism:Homo sapiens (Human)
Description:Q13547
Residue:482
BDBM172895
NameBDBM172895
Synonyms:US9096559, 1
TypeSmall organic molecule
Emp. Form.C27H23N4O3
Mol. Mass.451.4971
SMILESNc1ccc(cc1NC(=O)c1ccc(CN(Cc2cccnc2)C([O-])=O)cc1)-c1ccccc1