Reaction Details
TargetHistone deacetylase 1
LigandBDBM172773
Substrate/Competitorn/a
Meas. Tech.Flag Assay
IC50 17±n/a nM
Citation Harrington, PHeidebrecht, Jr., RWKattar, SMiller, TAOtte, KMSiliphaivanh, PStanton, MGTempest, PWilson, KJWitter, DJ 4-carboxybenzylamino derivatives as histone deacetylase inhibitors US Patent US9096559 Publication Date 8/4/2015
 
Histone deacetylase 1
Name:Histone deacetylase 1
Type:Enzyme
Mol. Mass.:55090.27
Organism:Homo sapiens (Human)
Description:Q13547
Residue:482
BDBM172773
NameBDBM172773
Synonyms:US9096559, 3
TypeSmall organic molecule
Emp. Form.C26H23N5O3
Mol. Mass.453.4925
SMILESNc1ccc(cc1NC(=O)c1ccc(CNC(=O)OCc2cccnc2)cc1)-c1cccnc1