Reaction Details
TargetHistone deacetylase 1
LigandBDBM172776
Substrate/Competitorn/a
Meas. Tech.Flag Assay
IC50 16±n/a nM
Citation Harrington, PHeidebrecht, Jr., RWKattar, SMiller, TAOtte, KMSiliphaivanh, PStanton, MGTempest, PWilson, KJWitter, DJ 4-carboxybenzylamino derivatives as histone deacetylase inhibitors US Patent US9096559 Publication Date 8/4/2015
 
Histone deacetylase 1
Name:Histone deacetylase 1
Type:Enzyme
Mol. Mass.:55090.27
Organism:Homo sapiens (Human)
Description:Q13547
Residue:482
BDBM172776
NameBDBM172776
Synonyms:US9096559, 6
TypeSmall organic molecule
Emp. Form.C26H22N4O4
Mol. Mass.454.4773
SMILESOc1ccc(cc1NC(=O)c1ccc(CNC(=O)OCc2cccnc2)cc1)-c1cccnc1