Reaction Details
TargetHistone deacetylase 1
LigandBDBM50229192
Substrate/Competitorn/a
Meas. Tech.Flag Assay
IC50 17±n/a nM
Citation Harrington, PHeidebrecht, Jr., RWKattar, SMiller, TAOtte, KMSiliphaivanh, PStanton, MGTempest, PWilson, KJWitter, DJ 4-carboxybenzylamino derivatives as histone deacetylase inhibitors US Patent US9096559 Publication Date 8/4/2015
 
Histone deacetylase 1
Name:Histone deacetylase 1
Type:Enzyme
Mol. Mass.:55090.27
Organism:Homo sapiens (Human)
Description:Q13547
Residue:482
BDBM50229192
NameBDBM50229192
Synonyms:CHEMBL398420 US9096559, 9 | [4-(4-amino-biphenyl-3-ylcarbamoyl)-benzyl]-carbamic acid methyl ester
TypeSmall organic molecule
Emp. Form.C22H21N3O3
Mol. Mass.375.4204
SMILESCOC(=O)NCc1ccc(cc1)C(=O)Nc1cc(ccc1N)-c1ccccc1