Reaction Details
TargetHistone deacetylase 1
LigandBDBM50229201
Substrate/Competitorn/a
Meas. Tech.Flag Assay
IC50 17±n/a nM
Citation Harrington, PHeidebrecht, Jr., RWKattar, SMiller, TAOtte, KMSiliphaivanh, PStanton, MGTempest, PWilson, KJWitter, DJ 4-carboxybenzylamino derivatives as histone deacetylase inhibitors US Patent US9096559 Publication Date 8/4/2015
 
Histone deacetylase 1
Name:Histone deacetylase 1
Type:Enzyme
Mol. Mass.:55090.27
Organism:Homo sapiens (Human)
Description:Q13547
Residue:482
BDBM50229201
NameBDBM50229201
Synonyms:CHEMBL253226 US9096559, 14g
TypeSmall organic molecule
Emp. Form.C24H25N3O2
Mol. Mass.387.4742
SMILESCCCC(=O)NCc1ccc(cc1)C(=O)Nc1cc(ccc1N)-c1ccccc1