Reaction Details
TargetHistone deacetylase 1
LigandBDBM172798
Substrate/Competitorn/a
Meas. Tech.Flag Assay
IC50 14±n/a nM
Citation Harrington, PHeidebrecht, Jr., RWKattar, SMiller, TAOtte, KMSiliphaivanh, PStanton, MGTempest, PWilson, KJWitter, DJ 4-carboxybenzylamino derivatives as histone deacetylase inhibitors US Patent US9096559 Publication Date 8/4/2015
 
Histone deacetylase 1
Name:Histone deacetylase 1
Type:Enzyme
Mol. Mass.:55090.27
Organism:Homo sapiens (Human)
Description:Q13547
Residue:482
BDBM172798
NameBDBM172798
Synonyms:US9096559, 29
TypeSmall organic molecule
Emp. Form.C25H27N3O2
Mol. Mass.401.5008
SMILESCC(C)CC(=O)NCc1ccc(cc1)C(=O)Nc1cc(ccc1N)-c1ccccc1