Reaction Details
TargetHistone deacetylase 1
LigandBDBM172805
Substrate/Competitorn/a
Meas. Tech.Flag Assay
IC50 15±n/a nM
Citation Harrington, PHeidebrecht, Jr., RWKattar, SMiller, TAOtte, KMSiliphaivanh, PStanton, MGTempest, PWilson, KJWitter, DJ 4-carboxybenzylamino derivatives as histone deacetylase inhibitors US Patent US9096559 Publication Date 8/4/2015
 
Histone deacetylase 1
Name:Histone deacetylase 1
Type:Enzyme
Mol. Mass.:55090.27
Organism:Homo sapiens (Human)
Description:Q13547
Residue:482
BDBM172805
NameBDBM172805
Synonyms:US9096559, 39
TypeSmall organic molecule
Emp. Form.C22H21N3O2S
Mol. Mass.391.486
SMILESNc1ccc(cc1NC(=O)c1ccc(CNC(=O)C2CC2)cc1)-c1cccs1