Reaction Details
TargetHistone deacetylase 1
LigandBDBM172827
Substrate/Competitorn/a
Meas. Tech.Flag Assay
IC50 17±n/a nM
Citation Harrington, PHeidebrecht, Jr., RWKattar, SMiller, TAOtte, KMSiliphaivanh, PStanton, MGTempest, PWilson, KJWitter, DJ 4-carboxybenzylamino derivatives as histone deacetylase inhibitors US Patent US9096559 Publication Date 8/4/2015
 
Histone deacetylase 1
Name:Histone deacetylase 1
Type:Enzyme
Mol. Mass.:55090.27
Organism:Homo sapiens (Human)
Description:Q13547
Residue:482
BDBM172827
NameBDBM172827
Synonyms:US9096559, 60
TypeSmall organic molecule
Emp. Form.C20H22N4O3S2
Mol. Mass.430.544
SMILESCN(C)S(=O)(=O)NCc1ccc(cc1)C(=O)Nc1cc(ccc1N)-c1cccs1