Reaction Details
TargetHistone deacetylase 1
LigandBDBM172833
Substrate/Competitorn/a
Meas. Tech.Flag Assay
IC50 15±n/a nM
Citation Harrington, PHeidebrecht, Jr., RWKattar, SMiller, TAOtte, KMSiliphaivanh, PStanton, MGTempest, PWilson, KJWitter, DJ 4-carboxybenzylamino derivatives as histone deacetylase inhibitors US Patent US9096559 Publication Date 8/4/2015
 
Histone deacetylase 1
Name:Histone deacetylase 1
Type:Enzyme
Mol. Mass.:55090.27
Organism:Homo sapiens (Human)
Description:Q13547
Residue:482
BDBM172833
NameBDBM172833
Synonyms:US9096559, 69
TypeSmall organic molecule
Emp. Form.C24H22N4OS
Mol. Mass.414.523
SMILESCc1csc(c1)-c1ccc(N)c(NC(=O)c2ccc(CNc3ccncc3)cc2)c1