Reaction Details
TargetHistone deacetylase 1
LigandBDBM172859
Substrate/Competitorn/a
Meas. Tech.Flag Assay
IC50 18±n/a nM
Citation Harrington, PHeidebrecht, Jr., RWKattar, SMiller, TAOtte, KMSiliphaivanh, PStanton, MGTempest, PWilson, KJWitter, DJ 4-carboxybenzylamino derivatives as histone deacetylase inhibitors US Patent US9096559 Publication Date 8/4/2015
 
Histone deacetylase 1
Name:Histone deacetylase 1
Type:Enzyme
Mol. Mass.:55090.27
Organism:Homo sapiens (Human)
Description:Q13547
Residue:482
BDBM172859
NameBDBM172859
Synonyms:US9096559, 99
TypeSmall organic molecule
Emp. Form.C25H29N3O2
Mol. Mass.403.5167
SMILESCNCCCN(C)Cc1ccc(cc1)C(=O)Nc1cc(ccc1O)-c1ccccc1