Reaction Details
TargetHistone deacetylase 1
LigandBDBM172802
Substrate/Competitorn/a
Meas. Tech.Flag Assay
IC50 17±n/a nM
Citation Harrington, PHeidebrecht, Jr., RWKattar, SMiller, TAOtte, KMSiliphaivanh, PStanton, MGTempest, PWilson, KJWitter, DJ 4-carboxybenzylamino derivatives as histone deacetylase inhibitors US Patent US9096559 Publication Date 8/4/2015
 
Histone deacetylase 1
Name:Histone deacetylase 1
Type:Enzyme
Mol. Mass.:55090.27
Organism:Homo sapiens (Human)
Description:Q13547
Residue:482
BDBM172802
NameBDBM172802
Synonyms:US9096559, 14c | US9096559, 34
TypeSmall organic molecule
Emp. Form.C28H25N3O2
Mol. Mass.435.517
SMILESNc1ccc(cc1NC(=O)c1ccc(CNC(=O)Cc2ccccc2)cc1)-c1ccccc1