Reaction Details
TargetNeuraminidase
LigandBDBM5232
Substrate/CompetitorBDBM4702
Meas. Tech.Neuraminidase Inhibition Assay
IC50 60±n/a nM
Citation Lew, WWu, HMendel, DBEscarpe, PAChen, XLaver, WGGraves, BJKim, CU A new series of C3-aza carbocyclic influenza neuraminidase inhibitors: synthesis and inhibitory activity. Bioorg Med Chem Lett8:3321-4 (1998) 
 
Neuraminidase
Name:Neuraminidase
Type:Enzyme
Mol. Mass.:51446.67
Organism:Influenza B virus (B/Lee/40)
Description:n/a
Residue:466
BDBM5232
BDBM4702
NameBDBM5232
Synonyms:(3R,4R,5S)-5-amino-3-(dipropylamino)-4-acetamidocyclohex-1-ene-1-carboxylic acid | C3-Aza Carbocyclic Analogue 3h
TypeSmall organic molecule
Emp. Form.C15H27N3O3
Mol. Mass.297.3932
SMILESCCCN(CCC)[C@@H]1C=C(C[C@H](N)[C@H]1NC(C)=O)C(O)=O