Reaction Details
TargetNon-secretory ribonuclease
LigandBDBM173612
Substrate/Competitorn/a
Meas. Tech.Ribonuclease Activity Assay
Temperature303.15±n/a K
Ki 5.78e+4± 7.1e+3 nM
IC50 8.86e+4± 6e+2 nM
Commentsextracted
Citation Chatzileontiadou, DSParmenopoulou, VManta, SKantsadi, ALKylindri, PGriniezaki, MKontopoulou, FTelopoulou, AProkova, HPanagopoulos, DBoix, EBalatsos, NAKomiotis, DLeonidas, DD Triazole double-headed ribonucleosides as inhibitors of eosinophil derived neurotoxin. Bioorg Chem63:152-65 (2015) 
 
Non-secretory ribonuclease
Name:Non-secretory ribonuclease
Type:Protein
Mol. Mass.:18364.09
Organism:Homo sapiens (Human)
Description:n/a
Residue:161
BDBM173612
NameBDBM173612
Synonyms:9-[3'-[4-[(Cytosine-1-yl)methyl]-1,2,3-triazol-1-yl]-b-D-ribofuranosyl]adenine (11c)
TypeSmall organic molecule
Emp. Form.C17H21N11O4
Mol. Mass.443.4199
SMILESNC1=NC=NC2C1N=CN2[C@@H]1O[C@H](CO)[C@@H](C1O)n1cc(Cn2ccc(N)nc2=O)nn1