Reaction Details
TargetP2X purinoceptor 7
LigandBDBM173649
Substrate/Competitorn/a
Meas. Tech.Binding Assay
pH7.4±n/a
Temperature298.15±n/a K
IC50 0.28±n/a nM
Commentsextracted
Citation Kilburn, JPRasmussen, LKJessing, MEldemenky, EMChen, BJiang, YHopper, AT Benzamides US Patent US9102591 Publication Date 8/11/2015
 
P2X purinoceptor 7
Name:P2X purinoceptor 7
Type:Protein
Mol. Mass.:68602.85
Organism:Homo sapiens (Human)
Description:Q99572
Residue:595
BDBM173649
NameBDBM173649
Synonyms:US9102591, 2,3-dichloro-N-[[4,4-difluoro-1-(6-fluoro-3-pyridyl)cyclohexyl]methyl]benzamide | US9649308, 2,3-dichloro-N-[[4,4-difluoro-1-(6-fluoro-3-pyridyl)cyclohexyl]methyl]benzamide
TypeSmall organic molecule
Emp. Form.C19H17Cl2F3N2O
Mol. Mass.417.252
SMILESFc1ccc(cn1)C1(CNC(=O)c2cccc(Cl)c2Cl)CCC(F)(F)CC1