Reaction Details
TargetNeuraminidase
LigandBDBM5251
Substrate/CompetitorBDBM4702
Meas. Tech.Neuraminidase Inhibition Assay
pH6.5±n/a
Temperature310.15±n/a K
IC50 310±n/a nM
Citation Lew, WWu, HChen, XGraves, BJEscarpe, PAMacArthur, HLMendel, DBKim, CU Carbocyclic influenza neuraminidase inhibitors possessing a C3-cyclic amine side chain: synthesis and inhibitory activity. Bioorg Med Chem Lett10:1257-60 (2000) 
 
Neuraminidase
Name:Neuraminidase
Type:Enzyme
Mol. Mass.:50124.14
Organism:Influenza A virus (A/Puerto Rico/8/34/Mount Sinai(H1N1))
Description:P03468
Residue:454
BDBM5251
BDBM4702
NameBDBM5251
Synonyms:(3R,4R,5S)-5-amino-4-acetamido-3-(pyrrolidin-1-yl)cyclohex-1-ene-1-carboxylic acid | C3-Cyclic Amine Carbocyclic Analogue 4b
TypeSmall organic molecule
Emp. Form.C13H21N3O3
Mol. Mass.267.3241
SMILESCC(=O)N[C@@H]1[C@@H](N)CC(=C[C@H]1N1CCCC1)C(O)=O