Reaction Details
TargetNeuraminidase
LigandBDBM5252
Substrate/CompetitorBDBM4702
Meas. Tech.Neuraminidase Inhibition Assay
IC50 4±n/a nM
Citation Lew, WWu, HChen, XGraves, BJEscarpe, PAMacArthur, HLMendel, DBKim, CU Carbocyclic influenza neuraminidase inhibitors possessing a C3-cyclic amine side chain: synthesis and inhibitory activity. Bioorg Med Chem Lett10:1257-60 (2000) 
 
Neuraminidase
Name:Neuraminidase
Type:Enzyme
Mol. Mass.:51446.67
Organism:Influenza B virus (B/Lee/40)
Description:n/a
Residue:466
BDBM5252
BDBM4702
NameBDBM5252
Synonyms:(3R,4R,5S)-5-amino-4-acetamido-3-(piperidin-1-yl)cyclohex-1-ene-1-carboxylic acid | C3-Cyclic Amine Carbocyclic Analogue 4c
TypeSmall organic molecule
Emp. Form.C14H23N3O3
Mol. Mass.281.3507
SMILESCC(=O)N[C@@H]1[C@@H](N)CC(=C[C@H]1N1CCCCC1)C(O)=O