Reaction Details
TargetNeuraminidase
LigandBDBM5261
Substrate/CompetitorBDBM4702
Meas. Tech.Neuraminidase Inhibition Assay
IC50 87±n/a nM
Citation Lew, WWu, HChen, XGraves, BJEscarpe, PAMacArthur, HLMendel, DBKim, CU Carbocyclic influenza neuraminidase inhibitors possessing a C3-cyclic amine side chain: synthesis and inhibitory activity. Bioorg Med Chem Lett10:1257-60 (2000) 
 
Neuraminidase
Name:Neuraminidase
Type:Enzyme
Mol. Mass.:51446.67
Organism:Influenza B virus (B/Lee/40)
Description:n/a
Residue:466
BDBM5261
BDBM4702
NameBDBM5261
Synonyms:(3R,4R,5S)-5-amino-4-acetamido-3-(4-propylpiperidin-1-yl)cyclohex-1-ene-1-carboxylic acid | C3-Cyclic Amine Carbocyclic Analogue 4l
TypeSmall organic molecule
Emp. Form.C17H29N3O3
Mol. Mass.323.4305
SMILESCCCC1CCN(CC1)[C@@H]1C=C(C[C@H](N)[C@H]1NC(C)=O)C(O)=O