Reaction Details
TargetProtein Nef
LigandBDBM288033
Substrate/Competitorn/a
Meas. Tech.Measurement of Antiviral (HIV-1) Activity
Temperature298.15±n/a K
EC50 9.10±n/a nM
Commentsextracted
Citation Miyazaki, SIsoshima, HOshita, KKawashita, SNagahashi, NTerashita, M Substituted spiropyrido[1,2-a]pyrazine derivative and medicinal use thereof as HIV integrase inhibitor US Patent US10087178 Publication Date 10/2/2018
 
Protein Nef
Name:Protein Nef
Type:C-terminal core protein
Mol. Mass.:23340.47
Organism:Human immunodeficiency virus type 1 (isolate BRU/LAI group M subtype B)
Description:P03406
Residue:206
BDBM288033
NameBDBM288033
Synonyms:US10087178, Example 14
TypeSmall organic molecule
Emp. Form.C23H25F2N3O5
Mol. Mass.461.4585
SMILESCOC[C@H]1C[C@]11CN(C(C)C)C(=O)c2c(O)c(=O)c(cn12)C(=O)NCc1ccc(F)cc1F