Reaction Details
TargetProtein Nef
LigandBDBM288036
Substrate/Competitorn/a
Meas. Tech.Measurement of Antiviral (HIV-1) Activity
Temperature298.15±n/a K
EC50 3.40±n/a nM
Commentsextracted
Citation Miyazaki, SIsoshima, HOshita, KKawashita, SNagahashi, NTerashita, M Substituted spiropyrido[1,2-a]pyrazine derivative and medicinal use thereof as HIV integrase inhibitor US Patent US10087178 Publication Date 10/2/2018
 
Protein Nef
Name:Protein Nef
Type:C-terminal core protein
Mol. Mass.:23340.47
Organism:Human immunodeficiency virus type 1 (isolate BRU/LAI group M subtype B)
Description:P03406
Residue:206
BDBM288036
NameBDBM288036
Synonyms:US10087178, Example 17
TypeSmall organic molecule
Emp. Form.C22H23ClFN3O5
Mol. Mass.463.887
SMILESCCN1C(=O)c2c(O)c(=O)c(cn2C[C@@]11C[C@@H]1COC)C(=O)NCc1cccc(Cl)c1F