Reaction Details
TargetProtein Nef
LigandBDBM288040
Substrate/Competitorn/a
Meas. Tech.Measurement of Antiviral (HIV-1) Activity
Temperature298.15±n/a K
EC50 48.0±n/a nM
Commentsextracted
Citation Miyazaki, SIsoshima, HOshita, KKawashita, SNagahashi, NTerashita, M Substituted spiropyrido[1,2-a]pyrazine derivative and medicinal use thereof as HIV integrase inhibitor US Patent US10087178 Publication Date 10/2/2018
 
Protein Nef
Name:Protein Nef
Type:C-terminal core protein
Mol. Mass.:23340.47
Organism:Human immunodeficiency virus type 1 (isolate BRU/LAI group M subtype B)
Description:P03406
Residue:206
BDBM288040
NameBDBM288040
Synonyms:US10087178, Example 21
TypeSmall organic molecule
Emp. Form.C23H25ClFN3O6S
Mol. Mass.525.978
SMILESCC(C)N1C[C@]2(C[C@H]2CS(C)(=O)=O)n2cc(C(=O)NCc3cccc(Cl)c3F)c(=O)c(O)c2C1=O