Reaction Details
TargetProtein Nef
LigandBDBM288056
Substrate/Competitorn/a
Meas. Tech.Measurement of Antiviral (HIV-1) Activity
Temperature298.15±n/a K
EC50 7.80±n/a nM
Commentsextracted
Citation Miyazaki, SIsoshima, HOshita, KKawashita, SNagahashi, NTerashita, M Substituted spiropyrido[1,2-a]pyrazine derivative and medicinal use thereof as HIV integrase inhibitor US Patent US10087178 Publication Date 10/2/2018
 
Protein Nef
Name:Protein Nef
Type:C-terminal core protein
Mol. Mass.:23340.47
Organism:Human immunodeficiency virus type 1 (isolate BRU/LAI group M subtype B)
Description:P03406
Residue:206
BDBM288056
NameBDBM288056
Synonyms:US10087178, Example S16 | cis-3-(benzyloxy)-N-(2,4- difluorobenzyl)-2'-ethyl-9'- hydroxy-1',8'-dioxo- 1',2',3',8'- tetrahydrospiro[cyclobutane- 1,4'-pyrido[1,2-a]pyrazine]- 7'-carboxamide hydrochloride
TypeSmall organic molecule
Emp. Form.C28H27F2N3O5
Mol. Mass.523.5279
SMILESCCN1C[C@]2(C[C@@H](C2)OCc2ccccc2)n2cc(C(=O)NCc3ccc(F)cc3F)c(=O)c(O)c2C1=O