Reaction Details
TargetProtein Nef
LigandBDBM288057
Substrate/Competitorn/a
Meas. Tech.Measurement of Antiviral (HIV-1) Activity
Temperature298.15±n/a K
EC50 20.0±n/a nM
Commentsextracted
Citation Miyazaki, SIsoshima, HOshita, KKawashita, SNagahashi, NTerashita, M Substituted spiropyrido[1,2-a]pyrazine derivative and medicinal use thereof as HIV integrase inhibitor US Patent US10087178 Publication Date 10/2/2018
 
Protein Nef
Name:Protein Nef
Type:C-terminal core protein
Mol. Mass.:23340.47
Organism:Human immunodeficiency virus type 1 (isolate BRU/LAI group M subtype B)
Description:P03406
Residue:206
BDBM288057
NameBDBM288057
Synonyms:N-(2,4-difluorobenzyl)-2'- ethyl-trans-3,9'-dihydroxy- 1',8'-dioxo-1',2',3',8'- tetrahydrospiro[cyclobutane- 1,4'-pyrido[1,2-a]pyrazine]- 7'-carboxamide hydrobromide | US10087178, Example S17
TypeSmall organic molecule
Emp. Form.C21H21F2N3O5
Mol. Mass.433.4053
SMILESCCN1C[C@@]2(C[C@H](O)C2)n2cc(C(=O)NCc3ccc(F)cc3F)c(=O)c(O)c2C1=O